Çözüldü db build error

Bu konu çözüme ulaştırılmıştır. Çözüm için konuya yazılan tüm yorumları okumayı unutmayın. Eğer konudaki yorumlar sorununuzu çözmediyse yeni bir konu açabilirsiniz.
Durum
İçerik kilitlendiği için mesaj gönderimine kapatıldı.

IamCeLlIsT

Çaylak Üye
Üye
Mesaj
6
Beğeni
2
Puan
23
merhaba

[email protected]:/home/novaline/Srcs/Server/db/src # gmake -j14
g++: ": No such file or directory
<command-line>: warning: missing terminating " character
version.cpp:11: error: missing terminating " character
version.cpp: In function 'void WriteVersion()':
version.cpp:11: error: expected primary-expression before ')' token
Makefile:68: recipe for target '.obj/version.o' failed
gmake: *** [.obj/version.o] Error 1

bu hatayı nasıl çözebilirim?
 

hasanmacit

developgenel kurmay başkanı
Geliştirici
Yardımsever Üye
Usta Üye
Yazar
Mesaj
1.168
Beğeni
618
Puan
1.109
gcc bulamıyor 4.8 default sanırım. makinen yeniyse eski sourceyle build alamazsın. yükseltmeler yapman gerekiyor. @Whistle nin eğitim serisinden bakarak yapabilirsin
 

hasanmacit

developgenel kurmay başkanı
Geliştirici
Yardımsever Üye
Usta Üye
Yazar
Mesaj
1.168
Beğeni
618
Puan
1.109
Yada Uygun Paketleri Yüklemen Gerek Filesi Nereden Aldıysan yada İndirdiysen Orada FRBSD Kaç Ve Hangi Paketler Gerekli Öğren Sonra Paketleri Kur Kurmayı Bilmiyorsan @Whistle Hocanın Eğitim Serisindeki Şu
Linkleri görebilmek için giriş yap veya kayıt ol.
Bakarak Öğrenebilirsin.
adam gcc48 arıyor onu indirebileceği yer yok çok eski bsd ile çalışması lazım başka çaresi yok
 
Durum
İçerik kilitlendiği için mesaj gönderimine kapatıldı.

Üst